Reaction Details
TargetInterleukin-1 receptor-associated kinase 4
LigandBDBM50246762
Substrate/Competitorn/a
Meas. Tech.ChEMBL_1676839 (CHEMBL4026982)
IC50 2.0±n/a nM
Citation Scott, JSDegorce, SLAnjum, RCulshaw, JDavies, RDMDavies, NLDillman, KSDowling, JEDrew, LFerguson, ADGroombridge, SDHalsall, CTHudson, JALamont, SLindsay, NAMarden, SKMayo, MFPease, JEPerkins, DRPink, JHRobb, GRRosen, AShen, MMcWhirter, CWu, D Discovery and Optimization of Pyrrolopyrimidine Inhibitors of Interleukin-1 Receptor Associated Kinase 4 (IRAK4) for the Treatment of Mutant MYD88 J Med Chem60:10071-10091 (2017) 
 
Interleukin-1 receptor-associated kinase 4
Name:Interleukin-1 receptor-associated kinase 4
Type:Protein
Mol. Mass.:51519.08
Organism:Homo sapiens (Human)
Description:Q9NWZ3
Residue:460
BDBM50246762
NameBDBM50246762
Synonyms:CHEMBL4078222
TypeSmall organic molecule
Emp. Form.C25H36N6O2
Mol. Mass.452.5923
SMILES[H][C@]12CC(=O)N(C)[C@@]1([H])CCN(C2)[C@H]1CC[C@@H](CC1)Nc1ncnc2[nH]cc(C3CCOCC3)c12