Reaction Details
TargetInterleukin-1 receptor-associated kinase 4
LigandBDBM50246779
Substrate/Competitorn/a
Meas. Tech.ChEMBL_1676839 (CHEMBL4026982)
IC50 2.0±n/a nM
Citation Scott, JSDegorce, SLAnjum, RCulshaw, JDavies, RDMDavies, NLDillman, KSDowling, JEDrew, LFerguson, ADGroombridge, SDHalsall, CTHudson, JALamont, SLindsay, NAMarden, SKMayo, MFPease, JEPerkins, DRPink, JHRobb, GRRosen, AShen, MMcWhirter, CWu, D Discovery and Optimization of Pyrrolopyrimidine Inhibitors of Interleukin-1 Receptor Associated Kinase 4 (IRAK4) for the Treatment of Mutant MYD88 J Med Chem60:10071-10091 (2017) 
 
Interleukin-1 receptor-associated kinase 4
Name:Interleukin-1 receptor-associated kinase 4
Type:Protein
Mol. Mass.:51519.08
Organism:Homo sapiens (Human)
Description:Q9NWZ3
Residue:460
BDBM50246779
NameBDBM50246779
Synonyms:CHEMBL4080574
TypeSmall organic molecule
Emp. Form.C23H34N6O2
Mol. Mass.426.5551
SMILESCC(=O)N1CCN(CC1)[C@H]1CC[C@@H](CC1)Nc1ncnc2[nH]cc(C3CCOCC3)c12