Reaction Details
TargetCholesteryl ester transfer protein
LigandBDBM50348228
Substrate/Competitorn/a
Meas. Tech.ChEBML_1681594
IC50 18±n/a nM
Citation Yamada, KBrousseau, MHonma, WIimura, AImase, HIwaki, YKawanami, TLaSala, DLiang, GMitani, HNonomura, KOhmori, OPan, MRigel, DFUmemura, IYasoshima, KZhu, GMogi, M Discovery of a Novel Piperidine-Based Inhibitor of Cholesteryl Ester Transfer Protein (CETP) That Retains Activity in Hypertriglyceridemic Plasma. J Med Chem60:8466-8481 (2017) 
 
Cholesteryl ester transfer protein
Name:Cholesteryl ester transfer protein
Type:Enzyme
Mol. Mass.:54751.53
Organism:Homo sapiens (Human)
Description:P11597
Residue:493
BDBM50348228
NameBDBM50348228
Synonyms:CHEMBL1800807
TypeSmall organic molecule
Emp. Form.C30H25F10NO3
Mol. Mass.637.5084
SMILESCOc1cc(F)c(cc1-c1ccc(cc1CN1[C@@H](C)[C@H](OC1=O)c1cc(cc(c1)C(F)(F)F)C(F)(F)F)C(F)(F)F)C(C)C