Reaction Details
TargetCholesteryl ester transfer protein
LigandBDBM50381415
Substrate/Competitorn/a
Meas. Tech.ChEBML_1681594
IC50 110±n/a nM
Citation Yamada, KBrousseau, MHonma, WIimura, AImase, HIwaki, YKawanami, TLaSala, DLiang, GMitani, HNonomura, KOhmori, OPan, MRigel, DFUmemura, IYasoshima, KZhu, GMogi, M Discovery of a Novel Piperidine-Based Inhibitor of Cholesteryl Ester Transfer Protein (CETP) That Retains Activity in Hypertriglyceridemic Plasma. J Med Chem60:8466-8481 (2017) 
 
Cholesteryl ester transfer protein
Name:Cholesteryl ester transfer protein
Type:Enzyme
Mol. Mass.:54751.53
Organism:Homo sapiens (Human)
Description:P11597
Residue:493
BDBM50381415
NameBDBM50381415
Synonyms:EVACETRAPIB | LY2484595
TypeSmall organic molecule
Emp. Form.C31H36F6N6O2
Mol. Mass.638.647
SMILESCc1cc(C)c2N(C[C@H]3CC[C@@H](CC3)C(O)=O)CCC[C@H](N(Cc3cc(cc(c3)C(F)(F)F)C(F)(F)F)c3nnn(C)n3)c2c1