Reaction Details
TargetCholesteryl ester transfer protein
LigandBDBM50250371
Substrate/Competitorn/a
Meas. Tech.ChEBML_1681594
IC50 60±n/a nM
Citation Yamada, KBrousseau, MHonma, WIimura, AImase, HIwaki, YKawanami, TLaSala, DLiang, GMitani, HNonomura, KOhmori, OPan, MRigel, DFUmemura, IYasoshima, KZhu, GMogi, M Discovery of a Novel Piperidine-Based Inhibitor of Cholesteryl Ester Transfer Protein (CETP) That Retains Activity in Hypertriglyceridemic Plasma. J Med Chem60:8466-8481 (2017) 
 
Cholesteryl ester transfer protein
Name:Cholesteryl ester transfer protein
Type:Enzyme
Mol. Mass.:54751.53
Organism:Homo sapiens (Human)
Description:P11597
Residue:493
BDBM50250371
NameBDBM50250371
Synonyms:CHEMBL4064793
TypeSmall organic molecule
Emp. Form.C30H39F6N5O3
Mol. Mass.631.6528
SMILESCC[C@H]1C[C@H](C[C@@H](CC)N1C(=O)OC(C)C)N(Cc1cc(cc(c1)C(F)(F)F)C(F)(F)F)c1ncc(cn1)N1CCOCC1