Reaction Details
TargetAtypical chemokine receptor 3
LigandBDBM50250384
Substrate/Competitorn/a
Meas. Tech.ChEBML_1681651
Ki 32±n/a nM
Citation Boehm, MBeaumont, KJones, RKalgutkar, ASZhang, LAtkinson, KBai, GBrown, JAEng, HGoetz, GHHolder, BRKhunte, BLazzaro, SLimberakis, CRyu, SShapiro, MJTylaska, LYan, JTurner, RLeung, SSFRamaseshan, MPrice, DALiras, SJacobson, MPEarp, DJLokey, RSMathiowetz, AMMenhaji-Klotz, E Discovery of Potent and Orally Bioavailable Macrocyclic Peptide-Peptoid Hybrid CXCR7 Modulators. J Med Chem60:9653-9663 (2017) 
 
Atypical chemokine receptor 3
Name:Atypical chemokine receptor 3
Type:Enzyme
Mol. Mass.:41498.84
Organism:Homo sapiens (Human)
Description:P25106
Residue:362
BDBM50250384
NameBDBM50250384
Synonyms:CHEMBL4073495
TypeSmall organic molecule
Emp. Form.C53H55N9O6S
Mol. Mass.946.125
SMILESO=C1CN(CCCc2ccccc2)C(=O)[C@H]2CCCN2C(=O)[C@H](Cc2cscn2)NC(=O)[C@H](Cc2c[nH]c3ccccc23)NC(=O)[C@@H](Cc2ccccc2)NC(=O)[C@H](Cc2c[nH]c3ccccc23)N1