Reaction Details
TargetAtypical chemokine receptor 3
LigandBDBM50250393
Substrate/Competitorn/a
Meas. Tech.ChEMBL_1681650 (CHEMBL4031927)
Ki 25±n/a nM
Citation Boehm, MBeaumont, KJones, RKalgutkar, ASZhang, LAtkinson, KBai, GBrown, JAEng, HGoetz, GHHolder, BRKhunte, BLazzaro, SLimberakis, CRyu, SShapiro, MJTylaska, LYan, JTurner, RLeung, SSFRamaseshan, MPrice, DALiras, SJacobson, MPEarp, DJLokey, RSMathiowetz, AMMenhaji-Klotz, E Discovery of Potent and Orally Bioavailable Macrocyclic Peptide-Peptoid Hybrid CXCR7 Modulators. J Med Chem60:9653-9663 (2017) 
 
Atypical chemokine receptor 3
Name:Atypical chemokine receptor 3
Type:Enzyme
Mol. Mass.:41498.84
Organism:Homo sapiens (Human)
Description:P25106
Residue:362
BDBM50250393
NameBDBM50250393
Synonyms:CHEMBL4097577
TypeSmall organic molecule
Emp. Form.C47H55F2N7O6S
Mol. Mass.884.045
SMILESCC(C)(C)C[C@@H]1NC(=O)[C@@H](Cc2ccccc2)NC(=O)[C@H](Cc2ccccc2)NC(=O)CN(CCCc2ccc(F)cc2F)C(=O)[C@H]2CCCN2C(=O)[C@H](Cc2cscn2)NC1=O