Reaction Details
TargetAtypical chemokine receptor 3
LigandBDBM50250376
Substrate/Competitorn/a
Meas. Tech.ChEBML_1681651
Ki 211±n/a nM
Citation Boehm, MBeaumont, KJones, RKalgutkar, ASZhang, LAtkinson, KBai, GBrown, JAEng, HGoetz, GHHolder, BRKhunte, BLazzaro, SLimberakis, CRyu, SShapiro, MJTylaska, LYan, JTurner, RLeung, SSFRamaseshan, MPrice, DALiras, SJacobson, MPEarp, DJLokey, RSMathiowetz, AMMenhaji-Klotz, E Discovery of Potent and Orally Bioavailable Macrocyclic Peptide-Peptoid Hybrid CXCR7 Modulators. J Med Chem60:9653-9663 (2017) 
 
Atypical chemokine receptor 3
Name:Atypical chemokine receptor 3
Type:Enzyme
Mol. Mass.:41498.84
Organism:Homo sapiens (Human)
Description:P25106
Residue:362
BDBM50250376
NameBDBM50250376
Synonyms:CHEMBL4078800
TypeSmall organic molecule
Emp. Form.C52H60N8O6S
Mol. Mass.925.148
SMILESCN1[C@@H](Cc2cscn2)C(=O)N[C@@H](Cc2cccnc2)C(=O)N2CCC[C@@H]2C(=O)N(CCCc2ccccc2)CC(=O)N[C@@H](CCCc2ccccc2)C(=O)N(C)[C@H](Cc2ccccc2)C1=O