Reaction Details
TargetAtypical chemokine receptor 3
LigandBDBM50250401
Substrate/Competitorn/a
Meas. Tech.ChEBML_1681651
Ki 24±n/a nM
Citation Boehm, MBeaumont, KJones, RKalgutkar, ASZhang, LAtkinson, KBai, GBrown, JAEng, HGoetz, GHHolder, BRKhunte, BLazzaro, SLimberakis, CRyu, SShapiro, MJTylaska, LYan, JTurner, RLeung, SSFRamaseshan, MPrice, DALiras, SJacobson, MPEarp, DJLokey, RSMathiowetz, AMMenhaji-Klotz, E Discovery of Potent and Orally Bioavailable Macrocyclic Peptide-Peptoid Hybrid CXCR7 Modulators. J Med Chem60:9653-9663 (2017) 
 
Atypical chemokine receptor 3
Name:Atypical chemokine receptor 3
Type:Enzyme
Mol. Mass.:41498.84
Organism:Homo sapiens (Human)
Description:P25106
Residue:362
BDBM50250401
NameBDBM50250401
Synonyms:CHEMBL4067701
TypeSmall organic molecule
Emp. Form.C50H56N8O6S
Mol. Mass.897.095
SMILESO=C1CN(CCCc2ccccc2)C(=O)[C@H]2CCCN2C(=O)[C@H](Cc2cccnc2)NC(=O)[C@H](Cc2cscn2)NC(=O)[C@@H](Cc2ccccc2)NC(=O)[C@H](CCCc2ccccc2)N1