Reaction Details
TargetAtypical chemokine receptor 3
LigandBDBM50250402
Substrate/Competitorn/a
Meas. Tech.ChEMBL_1681650 (CHEMBL4031927)
Ki 8±n/a nM
Citation Boehm, MBeaumont, KJones, RKalgutkar, ASZhang, LAtkinson, KBai, GBrown, JAEng, HGoetz, GHHolder, BRKhunte, BLazzaro, SLimberakis, CRyu, SShapiro, MJTylaska, LYan, JTurner, RLeung, SSFRamaseshan, MPrice, DALiras, SJacobson, MPEarp, DJLokey, RSMathiowetz, AMMenhaji-Klotz, E Discovery of Potent and Orally Bioavailable Macrocyclic Peptide-Peptoid Hybrid CXCR7 Modulators. J Med Chem60:9653-9663 (2017) 
 
Atypical chemokine receptor 3
Name:Atypical chemokine receptor 3
Type:Enzyme
Mol. Mass.:41498.84
Organism:Homo sapiens (Human)
Description:P25106
Residue:362
BDBM50250402
NameBDBM50250402
Synonyms:CHEMBL4084835
TypeSmall organic molecule
Emp. Form.C53H59F2N11O6
Mol. Mass.984.1025
SMILESNC(=N)NCCC[C@@H]1NC(=O)[C@H](Cc2c[nH]c3ccccc23)NC(=O)[C@@H](Cc2ccccc2)NC(=O)[C@H](Cc2c[nH]c3ccccc23)NC(=O)CN(CCCc2ccc(F)cc2F)C(=O)[C@H]2CCCN2C1=O