Reaction Details
TargetMuscarinic acetylcholine receptor M2
LigandBDBM50005856
Substrate/Competitorn/a
Meas. Tech.ChEMBL_140187 (CHEMBL744904)
Ki 926.0±n/a nM
Citation Garvey, DSWasicak, JTChung, JYShue, YKCarrera, GMMay, PDMcKinney, MMAnderson, DCadman, EVella-Rountree, L Synthesis and in vitro characterization of novel amino terminally modified oxotremorine derivatives for brain muscarinic receptors. J Med Chem35:1550-7 (1992) Muscarinic acetylcholine receptor M2
Name:Muscarinic acetylcholine receptor M2
Type:Enzyme Catalytic Domain
Mol. Mass.:51555.53
Organism:RAT
Description:P10980
Residue:466
BDBM50005856
NameBDBM50005856
Synonyms:1-(4-Dimethylamino-but-2-ynyl)-pyrrolidin-2-one | CHEMBL41779
TypeSmall organic molecule
Emp. Form.C10H16N2O
Mol. Mass.180.2468
SMILESCN(C)CC#CCN1CCCC1=O