Reaction Details
TargetSerine/threonine-protein kinase PAK 4
LigandBDBM50251181
Substrate/Competitorn/a
Meas. Tech.ChEMBL_1683091 (CHEMBL4033368)
Ki 652±n/a nM
Citation Hao, CZhao, FSong, HGuo, JLi, XJiang, XHuan, RSong, SZhang, QWang, RWang, KPang, YLiu, TLu, THuang, WWang, JLin, BHe, ZLi, HLi, FZhao, DCheng, M Structure-Based Design of 6-Chloro-4-aminoquinazoline-2-carboxamide Derivatives as Potent and Selective p21-Activated Kinase 4 (PAK4) Inhibitors. J Med Chem61:265-285 (2018) 
 
Serine/threonine-protein kinase PAK 4
Name:Serine/threonine-protein kinase PAK 4
Type:Protein
Mol. Mass.:64098.01
Organism:Homo sapiens (Human)
Description:O96013
Residue:591
BDBM50251181
NameBDBM50251181
Synonyms:CHEMBL4102034
TypeSmall organic molecule
Emp. Form.C19H22ClN7
Mol. Mass.383.878
SMILESNC1CCN(CC1)c1nc(Nc2cn(cn2)C2CC2)c2cc(Cl)ccc2n1