Reaction Details
TargetSerine/threonine-protein kinase PAK 4
LigandBDBM50251137
Substrate/Competitorn/a
Meas. Tech.ChEMBL_1683091 (CHEMBL4033368)
Ki 17±n/a nM
Citation Hao, CZhao, FSong, HGuo, JLi, XJiang, XHuan, RSong, SZhang, QWang, RWang, KPang, YLiu, TLu, THuang, WWang, JLin, BHe, ZLi, HLi, FZhao, DCheng, M Structure-Based Design of 6-Chloro-4-aminoquinazoline-2-carboxamide Derivatives as Potent and Selective p21-Activated Kinase 4 (PAK4) Inhibitors. J Med Chem61:265-285 (2018) 
 
Serine/threonine-protein kinase PAK 4
Name:Serine/threonine-protein kinase PAK 4
Type:Protein
Mol. Mass.:64098.01
Organism:Homo sapiens (Human)
Description:O96013
Residue:591
BDBM50251137
NameBDBM50251137
Synonyms:CHEMBL4101547
TypeSmall organic molecule
Emp. Form.C20H23N7O
Mol. Mass.377.4429
SMILESC[C@@H]1CN(CCN1)C(=O)c1nc(Nc2cc([nH]n2)C2CC2)c2ccccc2n1