Reaction Details
TargetSodium channel protein type 9 subunit alpha
LigandBDBM50257214
Substrate/Competitorn/a
Meas. Tech.ChEBML_1689555
IC50 9.0±n/a nM
Citation Swain, NABatchelor, DBeaudoin, SBechle, BMBradley, PABrown, ADBrown, BButcher, KJButt, RPChapman, MLDenton, SEllis, DGalan, SRGGaulier, SMGreener, BSde Groot, MJGlossop, MSGurrell, IKHannam, JJohnson, MSLin, ZMarkworth, CJMarron, BEMillan, DSNakagawa, SPike, APrintzenhoff, DRawson, DJRansley, SJReister, SMSasaki, KStorer, RIStupple, PAWest, CW Discovery of Clinical Candidate 4-[2-(5-Amino-1H-pyrazol-4-yl)-4-chlorophenoxy]-5-chloro-2-fluoro-N-1,3-thiazol-4-ylbenzenesulfonamide (PF-05089771): Design and Optimization of Diaryl Ether Aryl Sulfonamides as Selective Inhibitors of Na J Med Chem60:7029-7042 (2017) 
 
Sodium channel protein type 9 subunit alpha
Name:Sodium channel protein type 9 subunit alpha
Type:Protein
Mol. Mass.:226375.97
Organism:Homo sapiens (Human)
Description:Q15858
Residue:1988
BDBM50257214
NameBDBM50257214
Synonyms:CHEMBL2325601
TypeSmall organic molecule
Emp. Form.C19H12ClF4N5O3S2
Mol. Mass.533.907
SMILESNc1n[nH]cc1-c1cc(ccc1Oc1cc(F)c(cc1Cl)S(=O)(=O)Nc1cscn1)C(F)(F)F