Reaction Details
TargetSodium channel protein type 4 subunit alpha
LigandBDBM50257175
Substrate/Competitorn/a
Meas. Tech.ChEBML_1689579
IC50>30000±n/a nM
Citation Swain, NABatchelor, DBeaudoin, SBechle, BMBradley, PABrown, ADBrown, BButcher, KJButt, RPChapman, MLDenton, SEllis, DGalan, SRGGaulier, SMGreener, BSde Groot, MJGlossop, MSGurrell, IKHannam, JJohnson, MSLin, ZMarkworth, CJMarron, BEMillan, DSNakagawa, SPike, APrintzenhoff, DRawson, DJRansley, SJReister, SMSasaki, KStorer, RIStupple, PAWest, CW Discovery of Clinical Candidate 4-[2-(5-Amino-1H-pyrazol-4-yl)-4-chlorophenoxy]-5-chloro-2-fluoro-N-1,3-thiazol-4-ylbenzenesulfonamide (PF-05089771): Design and Optimization of Diaryl Ether Aryl Sulfonamides as Selective Inhibitors of Na J Med Chem60:7029-7042 (2017) 
 
Sodium channel protein type 4 subunit alpha
Name:Sodium channel protein type 4 subunit alpha
Type:Protein
Mol. Mass.:208010.01
Organism:Homo sapiens (Human)
Description:P35499
Residue:1836
BDBM50257175
NameBDBM50257175
Synonyms:CHEMBL2324776
TypeSmall organic molecule
Emp. Form.C19H10ClF4N5O3S2
Mol. Mass.531.891
SMILESFc1cc(Oc2ccc(cc2-c2ccnnc2)C(F)(F)F)c(Cl)cc1S(=O)(=O)Nc1nncs1