Reaction Details
TargetCathepsin D
LigandBDBM50259954
Substrate/Competitorn/a
Meas. Tech.ChEBML_1692054
IC50>100000±n/a nM
Citation Butler, CROgilvie, KMartinez-Alsina, LBarreiro, GBeck, EMNolan, CEAtchison, KBenvenuti, EBuzon, LDoran, SGonzales, CHelal, CJHou, XHsu, MHJohnson, EFLapham, KLanyon, LParris, KO'Neill, BTRiddell, DRobshaw, AVajdos, FBrodney, MA Aminomethyl-Derived Beta Secretase (BACE1) Inhibitors: Engaging Gly230 without an Anilide Functionality. J Med Chem60:386-402 (2017) 
 
Cathepsin D
Name:Cathepsin D
Type:Enzyme
Mol. Mass.:44551.72
Organism:Homo sapiens (Human)
Description:Human proCathepsin D (SwissProt accession number P07339) was expressed in Sf9 cells, purified, and autoactivated.
Residue:412
BDBM50259954
NameBDBM50259954
Synonyms:CHEMBL4094377
TypeSmall organic molecule
Emp. Form.C16H20F5N3S
Mol. Mass.381.407
SMILESCC(C)(NCc1cc(c(F)cc1F)[C@]1(C)CCSC(N)=N1)C(F)(F)F