Reaction Details
TargetBeta-secretase 1
LigandBDBM50259960
Substrate/Competitorn/a
Meas. Tech.ChEMBL_1692055 (CHEMBL4042704)
IC50 24±n/a nM
Citation Butler, CROgilvie, KMartinez-Alsina, LBarreiro, GBeck, EMNolan, CEAtchison, KBenvenuti, EBuzon, LDoran, SGonzales, CHelal, CJHou, XHsu, MHJohnson, EFLapham, KLanyon, LParris, KO'Neill, BTRiddell, DRobshaw, AVajdos, FBrodney, MA Aminomethyl-Derived Beta Secretase (BACE1) Inhibitors: Engaging Gly230 without an Anilide Functionality. J Med Chem60:386-402 (2017) 
 
Beta-secretase 1
Name:Beta-secretase 1
Type:Protein
Mol. Mass.:55755.10
Organism:Homo sapiens (Human)
Description:P56817
Residue:501
BDBM50259960
NameBDBM50259960
Synonyms:CHEMBL4077211
TypeSmall organic molecule
Emp. Form.C16H18F2N4S
Mol. Mass.336.403
SMILESC[C@]1(CCSC(N)=N1)c1cc(CNC2(CC2)C#N)c(F)cc1F