Reaction Details
TargetPotassium voltage-gated channel subfamily H member 2
LigandBDBM50259954
Substrate/Competitorn/a
Meas. Tech.ChEMBL_1692061 (CHEMBL4042710)
IC50 11200±n/a nM
Citation Butler, CROgilvie, KMartinez-Alsina, LBarreiro, GBeck, EMNolan, CEAtchison, KBenvenuti, EBuzon, LDoran, SGonzales, CHelal, CJHou, XHsu, MHJohnson, EFLapham, KLanyon, LParris, KO'Neill, BTRiddell, DRobshaw, AVajdos, FBrodney, MA Aminomethyl-Derived Beta Secretase (BACE1) Inhibitors: Engaging Gly230 without an Anilide Functionality. J Med Chem60:386-402 (2017) 
 
Potassium voltage-gated channel subfamily H member 2
Name:Potassium voltage-gated channel subfamily H member 2
Type:Multi-pass membrane protein
Mol. Mass.:126672.65
Organism:Homo sapiens (Human)
Description:Q12809
Residue:1159
BDBM50259954
NameBDBM50259954
Synonyms:CHEMBL4094377
TypeSmall organic molecule
Emp. Form.C16H20F5N3S
Mol. Mass.381.407
SMILESCC(C)(NCc1cc(c(F)cc1F)[C@]1(C)CCSC(N)=N1)C(F)(F)F