Reaction Details
TargetBeta-secretase 1
LigandBDBM50259973
Substrate/Competitorn/a
Meas. Tech.ChEBML_1692052
IC50 69±n/a nM
Citation Butler, CROgilvie, KMartinez-Alsina, LBarreiro, GBeck, EMNolan, CEAtchison, KBenvenuti, EBuzon, LDoran, SGonzales, CHelal, CJHou, XHsu, MHJohnson, EFLapham, KLanyon, LParris, KO'Neill, BTRiddell, DRobshaw, AVajdos, FBrodney, MA Aminomethyl-Derived Beta Secretase (BACE1) Inhibitors: Engaging Gly230 without an Anilide Functionality. J Med Chem60:386-402 (2017) 
 
Beta-secretase 1
Name:Beta-secretase 1
Type:Protein
Mol. Mass.:55755.10
Organism:Homo sapiens (Human)
Description:P56817
Residue:501
BDBM50259973
NameBDBM50259973
Synonyms:CHEMBL4098403
TypeSmall organic molecule
Emp. Form.C16H18F5N3S
Mol. Mass.379.391
SMILESC[C@]1(CCSC(N)=N1)c1cc(CNC2(CC2)C(F)(F)F)c(F)cc1F