Reaction Details
TargetTyrosine-protein kinase JAK3
LigandBDBM50267804
Substrate/Competitorn/a
Meas. Tech.ChEBML_1703588
IC50 0.500000±n/a nM
Citation Hynes, JWu, HKempson, JDuan, JJLu, ZJiang, BStachura, STokarski, JSSack, JSKhan, JALippy, JSZhang, RFPitt, SShen, GGillooly, KMcIntyre, KCarter, PHBarrish, JCNadler, SGSalter-Cid, LMFura, ASchieven, GLPitts, WJWrobleski, ST Discovery of potent and efficacious pyrrolopyridazines as dual JAK1/3 inhibitors. Bioorg Med Chem Lett27:3101-3106 (2017) 
 
Tyrosine-protein kinase JAK3
Name:Tyrosine-protein kinase JAK3
Type:Protein
Mol. Mass.:125111.08
Organism:Homo sapiens (Human)
Description:P52333
Residue:1124
BDBM50267804
NameBDBM50267804
Synonyms:CHEMBL4070136
TypeSmall organic molecule
Emp. Form.C24H32N6O2
Mol. Mass.436.5499
SMILESCC(C)Oc1ccc(cn1)-c1cc2c(N[C@@H]3CC[C@](C)(N)C3(C)C)c(cnn2c1)C(N)=O