Reaction Details
TargetPhosphatidylinositol 4,5-bisphosphate 3-kinase catalytic subunit gamma isoform
LigandBDBM50274544
Substrate/Competitorn/a
Meas. Tech.ChEMBL_1714083 (CHEMBL4124132)
Ki 28±n/a nM
Citation Come, JHCollier, PNHenderson, JAPierce, ACDavies, RJLe Tiran, AO'Dowd, HBandarage, UKCao, JDeininger, DGrey, RKrueger, EBLowe, DBLiang, JLiao, YMessersmith, DNanthakumar, SSizensky, EWang, JXu, JChin, EYDamagnez, VDoran, JDDworakowski, WGriffith, JPJacobs, MDKhare-Pandit, SMahajan, SMoody, CSAronov, AM Design and Synthesis of a Novel Series of Orally Bioavailable, CNS-Penetrant, Isoform Selective Phosphoinositide 3-Kinase? (PI3K?) Inhibitors with Potential for the Treatment of Multiple Sclerosis (MS). J Med Chem61:5245-5256 (2018) 
 
Phosphatidylinositol 4,5-bisphosphate 3-kinase catalytic subunit gamma isoform
Name:Phosphatidylinositol 4,5-bisphosphate 3-kinase catalytic subunit gamma isoform
Type:Enzyme Subunit
Mol. Mass.:126470.30
Organism:Homo sapiens (Human)
Description:P48736
Residue:1102
BDBM50274544
NameBDBM50274544
Synonyms:CHEMBL4126620
TypeSmall organic molecule
Emp. Form.C21H20N6O3
Mol. Mass.404.4219
SMILESCOc1cc(cnc1OC)-c1ccc2C(=O)N(Cc2n1)c1cnn(c1)C(C)(C)C#N