Reaction Details
TargetPhosphatidylinositol 4,5-bisphosphate 3-kinase catalytic subunit gamma isoform
LigandBDBM50274540
Substrate/Competitorn/a
Meas. Tech.ChEMBL_1714083 (CHEMBL4124132)
Ki 11±n/a nM
Citation Come, JHCollier, PNHenderson, JAPierce, ACDavies, RJLe Tiran, AO'Dowd, HBandarage, UKCao, JDeininger, DGrey, RKrueger, EBLowe, DBLiang, JLiao, YMessersmith, DNanthakumar, SSizensky, EWang, JXu, JChin, EYDamagnez, VDoran, JDDworakowski, WGriffith, JPJacobs, MDKhare-Pandit, SMahajan, SMoody, CSAronov, AM Design and Synthesis of a Novel Series of Orally Bioavailable, CNS-Penetrant, Isoform Selective Phosphoinositide 3-Kinase? (PI3K?) Inhibitors with Potential for the Treatment of Multiple Sclerosis (MS). J Med Chem61:5245-5256 (2018) 
 
Phosphatidylinositol 4,5-bisphosphate 3-kinase catalytic subunit gamma isoform
Name:Phosphatidylinositol 4,5-bisphosphate 3-kinase catalytic subunit gamma isoform
Type:Enzyme Subunit
Mol. Mass.:126470.30
Organism:Homo sapiens (Human)
Description:P48736
Residue:1102
BDBM50274540
NameBDBM50274540
Synonyms:CHEMBL4128822
TypeSmall organic molecule
Emp. Form.C21H20F3N5O3
Mol. Mass.447.4104
SMILESCOc1cc(cnc1OC)-c1ccc2C(=O)N(c3cnn(CC(F)(F)F)c3)C(C)(C)c2n1