Reaction Details
TargetGlutamate receptor ionotropic, NMDA 2B
LigandBDBM198735
Substrate/Competitorn/a
Meas. Tech.ChEBML_1734327
Ki 11±n/a nM
Citation Marcin, LRWarrier, JThangathirupathy, SShi, JKarageorge, GNPearce, BCNg, APark, HKempson, JLi, JZhang, HMathur, AReddy, ABNagaraju, GTonukunuru, GGupta, GVRKMKamble, MMannoori, RCheruku, SJogi, SGulia, JBastia, TSanmathi, CAher, JKallem, RSrikumar, BNVijaya, KKNaidu, PSPaschapur, MKalidindi, NVikramadithyan, RRamarao, MDenton, RMolski, TShields, ESubramanian, MZhuo, XNophsker, MSimmermacher, JSinz, MAlbright, CBristow, LJIslam, IBronson, JJOlson, REKing, DThompson, LAMacor, JE BMS-986163, a Negative Allosteric Modulator of GluN2B with Potential Utility in Major Depressive Disorder. ACS Med Chem Lett9:472-477 (2018) 
 
Glutamate receptor ionotropic, NMDA 2B
Name:Glutamate receptor ionotropic, NMDA 2B
Type:Protein
Mol. Mass.:166077.66
Organism:Rattus norvegicus (Rat)
Description:Q00960
Residue:1482
BDBM198735
NameBDBM198735
Synonyms:US9221796, 48, P-3
TypeSmall organic molecule
Emp. Form.C22H24F2N2O2
Mol. Mass.386.435
SMILESOc1ccc(cc1)[C@@H]1CCN(C[C@H]1F)[C@@H]1CCN(Cc2ccc(F)cc2)C1=O