Reaction Details
TargetTyrosine-protein kinase ABL1
LigandBDBM213656
Substrate/Competitorn/a
Meas. Tech.ChEMBL_1765492 (CHEMBL4200739)
IC50 0.500000±n/a nM
Citation Schoepfer, JJahnke, WBerellini, GBuonamici, SCotesta, SCowan-Jacob, SWDodd, SDrueckes, PFabbro, DGabriel, TGroell, JMGrotzfeld, RMHassan, AQHenry, CIyer, VJones, DLombardo, FLoo, AManley, PWPellé, XRummel, GSalem, BWarmuth, MWylie, AAZoller, TMarzinzik, ALFuret, P Discovery of Asciminib (ABL001), an Allosteric Inhibitor of the Tyrosine Kinase Activity of BCR-ABL1. J Med Chem61:8120-8135 (2018) 
 
Tyrosine-protein kinase ABL1
Name:Tyrosine-protein kinase ABL1
Type:Enzyme
Mol. Mass.:122897.30
Organism:Homo sapiens (Human)
Description:P00519
Residue:1130
BDBM213656
NameBDBM213656
Synonyms:US9278981, 248
TypeSmall organic molecule
Emp. Form.C21H18ClF2N5O4
Mol. Mass.477.849
SMILESO[C@H]1CN(C[C@@H]1O)c1ncc(cc1-c1cncnc1)C(=O)Nc1ccc(OC(F)(F)Cl)cc1