Reaction Details
TargetAngiotensin-converting enzyme
LigandBDBM50024710
Substrate/Competitorn/a
Meas. Tech.ChEBML_34801
IC50 3.6±n/a nM
Citation Yanagisawa, HIshihara, SAndo, AKanazaki, TMiyamoto, SKoike, HIijima, YOizumi, KMatsushita, YHata, T Angiotensin-converting enzyme inhibitors: perhydro-1,4-thiazepin-5-one derivatives. J Med Chem30:1984-91 (1987) Angiotensin-converting enzyme
Name:Angiotensin-converting enzyme
Type:n/a
Mol. Mass.:150405.15
Organism:Oryctolagus cuniculus
Description:n/a
Residue:1310
BDBM50024710
NameBDBM50024710
Synonyms:2-(4-Carboxymethyl-5-oxo-2-thiophen-2-yl-[1,4]thiazepan-6-ylamino)-4-phenyl-butyric acid Temocaprilat
TypeSmall organic molecule
Emp. Form.C21H24N2O5S2
Mol. Mass.448.556
SMILESOC(=O)CN1C[C@H](SC[C@H](N[C@@H](CCc2ccccc2)C(O)=O)C1=O)c1cccs1