Reaction Details
TargetHistamine H4 receptor
LigandBDBM50409817
Substrate/Competitorn/a
Meas. Tech.ChEMBL_87229 (CHEMBL696449)
Ki 616±n/a nM
Citation Kitbunnadaj, RZuiderveld, OPDe Esch, IJVollinga, RCBakker, RLutz, MSpek, ALCavoy, EDeltent, MFMenge, WMTimmerman, HLeurs, R Synthesis and structure-activity relationships of conformationally constrained histamine H(3) receptor agonists. J Med Chem46:5445-57 (2003) 
 
Histamine H4 receptor
Name:Histamine H4 receptor
Type:G Protein-Coupled Receptor (GPCR)
Mol. Mass.:44517.02
Organism:Homo sapiens (Human)
Description:Binding assays were using CHO cells stably expressing hH4R receptors.
Residue:390
BDBM50409817
NameBDBM50409817
Synonyms:CHEMBL78498 | VUF-5681
TypeSmall organic molecule
Emp. Form.C11H19N3
Mol. Mass.193.2887
SMILESC(CC1CCNCC1)Cc1cnc[nH]1