Reaction Details
TargetHistamine H3 receptor
LigandBDBM50409817
Substrate/Competitorn/a
Meas. Tech.ChEMBL_83804 (CHEMBL692580)
Ki 4.5±n/a nM
Citation Kitbunnadaj, RZuiderveld, OPDe Esch, IJVollinga, RCBakker, RLutz, MSpek, ALCavoy, EDeltent, MFMenge, WMTimmerman, HLeurs, R Synthesis and structure-activity relationships of conformationally constrained histamine H(3) receptor agonists. J Med Chem46:5445-57 (2003) 
 
Histamine H3 receptor
Name:Histamine H3 receptor
Type:G Protein-Coupled Receptor (GPCR)
Mol. Mass.:48691.47
Organism:Homo sapiens (Human)
Description:Binding assays were using CHO cells stably expressing hH3R receptors.
Residue:445
BDBM50409817
NameBDBM50409817
Synonyms:CHEMBL78498 | VUF-5681
TypeSmall organic molecule
Emp. Form.C11H19N3
Mol. Mass.193.2887
SMILESC(CC1CCNCC1)Cc1cnc[nH]1