Reaction Details
TargetSqualene synthase
LigandBDBM50029158
Substrate/Competitorn/a
Meas. Tech.ChEMBL_202111 (CHEMBL808969)
IC50 3300±n/a nM
Citation Brown, GRButlin, RJChapman, SEakin, MAFoubister, AJFreeman, SGriffiths, DHarrison, PJJohnson, MCMallion, KB Phenoxypropylamines: a new series of squalene synthase inhibitors. J Med Chem38:4157-60 (1995) Squalene synthase
Name:Squalene synthase
Type:PROTEIN
Mol. Mass.:48109.41
Organism:Rattus norvegicus
Description:ChEMBL_1336736
Residue:416
BDBM50029158
NameBDBM50029158
Synonyms:CHEMBL423520 | [3-(4-Butoxy-phenoxy)-2-methoxy-propyl]-isopropyl-amine
TypeSmall organic molecule
Emp. Form.C17H29NO3
Mol. Mass.295.4171
SMILESCCCCOc1ccc(OCC(CNC(C)C)OC)cc1