Reaction Details
TargetSqualene synthase
LigandBDBM50029159
Substrate/Competitorn/a
Meas. Tech.ChEMBL_202111 (CHEMBL808969)
IC50 0.6±n/a nM
Citation Brown, GRButlin, RJChapman, SEakin, MAFoubister, AJFreeman, SGriffiths, DHarrison, PJJohnson, MCMallion, KB Phenoxypropylamines: a new series of squalene synthase inhibitors. J Med Chem38:4157-60 (1995) Squalene synthase
Name:Squalene synthase
Type:PROTEIN
Mol. Mass.:48109.41
Organism:Rattus norvegicus
Description:ChEMBL_1336736
Residue:416
BDBM50029159
NameBDBM50029159
Synonyms:CHEMBL132881 | [3-(2-Allyl-4-butoxy-phenoxy)-propyl]-isopropyl-amine
TypeSmall organic molecule
Emp. Form.C19H31NO2
Mol. Mass.305.4549
SMILESCCCCOc1ccc(OCCCNC(C)C)c(CC=C)c1