Reaction Details
TargetNeprilysin
LigandBDBM50041054
Substrate/Competitorn/a
Meas. Tech.ChEMBL_144449 (CHEMBL755096)
IC50 2.5±n/a nM
Citation Fournié-Zaluski, MCCoric, PTurcaud, SRousselet, NGonzalez, WBarbe, BPham, IJullian, NMichel, JBRoques, BP New dual inhibitors of neutral endopeptidase and angiotensin-converting enzyme: rational design, bioavailability, and pharmacological responses in experimental hypertension. J Med Chem37:1070-83 (1994) Neprilysin
Name:Neprilysin
Type:Enzyme
Mol. Mass.:85505.38
Organism:Homo sapiens (Human)
Description:P08473
Residue:750
BDBM50041054
NameBDBM50041054
Synonyms:3-(4-Hydroxy-phenyl)-2-(2-mercaptomethyl-3-phenyl-butyrylamino)-propionic acid | CHEMBL11616
TypeSmall organic molecule
Emp. Form.C20H23NO4S
Mol. Mass.373.466
SMILESCC(C(CS)C(=O)NC(Cc1ccc(O)cc1)C(O)=O)c1ccccc1