Reaction Details
TargetNeprilysin
LigandBDBM50041055
Substrate/Competitorn/a
Meas. Tech.ChEMBL_144449 (CHEMBL755096)
IC50 16±n/a nM
Citation Fournié-Zaluski, MCCoric, PTurcaud, SRousselet, NGonzalez, WBarbe, BPham, IJullian, NMichel, JBRoques, BP New dual inhibitors of neutral endopeptidase and angiotensin-converting enzyme: rational design, bioavailability, and pharmacological responses in experimental hypertension. J Med Chem37:1070-83 (1994) Neprilysin
Name:Neprilysin
Type:Enzyme
Mol. Mass.:85505.38
Organism:Homo sapiens (Human)
Description:P08473
Residue:750
BDBM50041055
NameBDBM50041055
Synonyms:2-[3-(4-Amino-phenyl)-2-mercaptomethyl-butyrylamino]-3-(4-hydroxy-phenyl)-propionic acid | CHEMBL273672
TypeSmall organic molecule
Emp. Form.C20H24N2O4S
Mol. Mass.388.481
SMILESCC(C(CS)C(=O)NC(Cc1ccc(O)cc1)C(O)=O)c1ccc(N)cc1