Reaction Details
TargetAngiotensin-converting enzyme
LigandBDBM50041067
Substrate/Competitorn/a
Meas. Tech.ChEMBL_36915 (CHEMBL647116)
IC50 10±n/a nM
Citation Fournié-Zaluski, MCCoric, PTurcaud, SRousselet, NGonzalez, WBarbe, BPham, IJullian, NMichel, JBRoques, BP New dual inhibitors of neutral endopeptidase and angiotensin-converting enzyme: rational design, bioavailability, and pharmacological responses in experimental hypertension. J Med Chem37:1070-83 (1994) Angiotensin-converting enzyme
Name:Angiotensin-converting enzyme
Type:PROTEIN
Mol. Mass.:150916.88
Organism:Mus musculus
Description:ChEMBL_34763
Residue:1312
BDBM50041067
NameBDBM50041067
Synonyms:2-[3-(4-Fluoro-phenyl)-2-mercaptomethyl-butyrylamino]-propionic acid | CHEMBL11297
TypeSmall organic molecule
Emp. Form.C14H18FNO3S
Mol. Mass.299.361
SMILESCC(NC(=O)C(CS)C(C)c1ccc(F)cc1)C(O)=O