Reaction Details
TargetPotassium voltage-gated channel subfamily H member 2
LigandBDBM50496099
Substrate/Competitorn/a
Meas. Tech.ChEMBL_1293874 (CHEMBL3123626)
IC50 9100±n/a nM
Citation Belema, MNguyen, VNBachand, CDeon, DHGoodrich, JTJames, CALavoie, RLopez, ODMartel, ARomine, JLRuediger, EHSnyder, LBSt Laurent, DRYang, FZhu, JWong, HSLangley, DRAdams, SPCantor, GHChimalakonda, AFura, AJohnson, BMKnipe, JOParker, DDSantone, KSFridell, RALemm, JAO'Boyle, DRColonno, RJGao, MMeanwell, NAHamann, LG Hepatitis C virus NS5A replication complex inhibitors: the discovery of daclatasvir. J Med Chem57:2013-32 (2014) 
 
Potassium voltage-gated channel subfamily H member 2
Name:Potassium voltage-gated channel subfamily H member 2
Type:Multi-pass membrane protein
Mol. Mass.:126672.65
Organism:Homo sapiens (Human)
Description:Q12809
Residue:1159
BDBM50496099
NameBDBM50496099
Synonyms:CHEMBL3121151
TypeSmall organic molecule
Emp. Form.C43H50N8O4
Mol. Mass.742.9083
SMILESCCN(CC)[C@@H](C(=O)N1CCC[C@H]1c1ncc([nH]1)-c1ccc(cc1)-c1ccc(cc1)-c1cnc([nH]1)[C@@H]1CCCN1C(=O)[C@H](C)NC(=O)OC)c1ccccc1