Reaction Details
TargetSerine/threonine-protein kinase B-raf
LigandBDBM50496946
Substrate/Competitorn/a
Meas. Tech.ChEMBL_1337752 (CHEMBL3240201)
IC50 0.300000±n/a nM
Citation Wenglowsky, SRen, LGrina, JHansen, JDLaird, ERMoreno, DDinkel, VGloor, SLHastings, GRana, SRasor, KSturgis, HLVoegtli, WCVigers, GWillis, BMathieu, SRudolph, J Highly potent and selective 3-N-methylquinazoline-4(3H)-one based inhibitors of B-Raf(V600E) kinase. Bioorg Med Chem Lett24:1923-7 (2014) 
 
Serine/threonine-protein kinase B-raf
Name:Serine/threonine-protein kinase B-raf
Type:Serine/threonine-protein kinase
Mol. Mass.:84446.00
Organism:Homo sapiens (Human)
Description:P15056
Residue:766
BDBM50496946
NameBDBM50496946
Synonyms:CHEMBL3236464
TypeSmall organic molecule
Emp. Form.C19H19N5O3S
Mol. Mass.397.451
SMILESCCCS(=O)(=O)Nc1cccc(Nc2ccc3ncn(C)c(=O)c3c2)c1C#N