Reaction Details
TargetNeprilysin
LigandBDBM50046258
Substrate/Competitorn/a
Meas. Tech.ChEBML_140760
IC50 50±n/a nM
Citation Gomez-Monterrey, ITurcaud, SLucas, EBruetschy, LRoques, BPFournié-Zaluski, MC Exploration of neutral endopeptidase active site by a series of new thiol-containing inhibitors. J Med Chem36:87-94 (1993) Neprilysin
Name:Neprilysin
Type:Enzyme
Mol. Mass.:85570.75
Organism:Oryctolagus cuniculus (rabbit)
Description:NEP was purified to homogeneity from rabbit kidney.
Residue:750
BDBM50046258
NameBDBM50046258
Synonyms:3-(4-Hydroxy-phenyl)-2-[2-(3-mercapto-5-methyl-hexanoylamino)-3-phenyl-propionylamino]-propionic acid CHEMBL367174
TypeSmall organic molecule
Emp. Form.C25H32N2O5S
Mol. Mass.472.597
SMILESCC(C)CC(S)CC(=O)NC(Cc1ccccc1)C(=O)NC(Cc1ccc(O)cc1)C(O)=O