Reaction Details
TargetNeprilysin
LigandBDBM50046267
Substrate/Competitorn/a
Meas. Tech.ChEBML_140760
IC50 20±n/a nM
Citation Gomez-Monterrey, ITurcaud, SLucas, EBruetschy, LRoques, BPFournié-Zaluski, MC Exploration of neutral endopeptidase active site by a series of new thiol-containing inhibitors. J Med Chem36:87-94 (1993) Neprilysin
Name:Neprilysin
Type:Enzyme
Mol. Mass.:85570.75
Organism:Oryctolagus cuniculus (rabbit)
Description:NEP was purified to homogeneity from rabbit kidney.
Residue:750
BDBM50046267
NameBDBM50046267
Synonyms:(RRS) 2-(2-Benzyl-3-mercapto-5-methyl-hexanoylamino)-propionic acid | CHEMBL174237
TypeSmall organic molecule
Emp. Form.C17H25NO3S
Mol. Mass.323.45
SMILESCC(C)C[C@@H](S)[C@H](Cc1ccccc1)C(=O)N[C@@H](C)C(O)=O