Reaction Details
TargetProtein mono-ADP-ribosyltransferase PARP6
LigandBDBM50499822
Substrate/Competitorn/a
Meas. Tech.ChEMBL_1541482 (CHEMBL3743853)
IC50 83±n/a nM
Citation Johannes, JWAlmeida, LDaly, KFerguson, ADGrosskurth, SEGuan, HHoward, TIoannidis, SKazmirski, SLamb, MLLarsen, NALyne, PDMikule, KOgoe, CPeng, BPetteruti, PRead, JASu, NSylvester, MThroner, SWang, WWang, XWu, JYe, QYu, YZheng, XScott, DA Discovery of AZ0108, an orally bioavailable phthalazinone PARP inhibitor that blocks centrosome clustering. Bioorg Med Chem Lett25:5743-7 (2015) 
 
Protein mono-ADP-ribosyltransferase PARP6
Name:Protein mono-ADP-ribosyltransferase PARP6
Type:PROTEIN
Mol. Mass.:71130.07
Organism:Homo sapiens (Human)
Description:ChEMBL_107589
Residue:630
BDBM50499822
NameBDBM50499822
Synonyms:CHEMBL3740897
TypeSmall organic molecule
Emp. Form.C24H20F4N6O2
Mol. Mass.500.4482
SMILESC[C@H]1Cn2c(CN1C(=O)c1cccc(c1)C(F)(F)c1n[nH]c(=O)c3ccccc13)nnc2C(C)(F)F