Reaction Details
TargetProstaglandin E2 receptor EP4 subtype
LigandBDBM50107283
Substrate/Competitorn/a
Meas. Tech.ChEMBL_1541020 (CHEMBL3744251)
IC50 12±n/a nM
Citation Blanco, MJVetman, TChandrasekhar, SFisher, MJHarvey, AMudra, DWang, XSYu, XPSchiffler, MAWarshawsky, AM Discovery of substituted-2,4-dimethyl-(naphthalene-4-carbonyl)amino-benzoic acid as potent and selective EP4 antagonists. Bioorg Med Chem Lett26:105-9 (2016) 
 
Prostaglandin E2 receptor EP4 subtype
Name:Prostaglandin E2 receptor EP4 subtype
Type:Enzyme
Mol. Mass.:53134.53
Organism:Homo sapiens (Human)
Description:P35408
Residue:488
BDBM50107283
NameBDBM50107283
Synonyms:AAT-007 Grapiprant RQ-00000007 | RQ-7
TypeSmall organic molecule
Emp. Form.C26H29N5O3S
Mol. Mass.491.605
SMILESCCc1nc2c(C)nc(C)cc2n1-c1ccc(CCNC(=O)NS(=O)(=O)c2ccc(C)cc2)cc1