Reaction Details
TargetSerine protease 1
LigandBDBM50054498
Substrate/Competitorn/a
Meas. Tech.ChEMBL_212717 (CHEMBL818176)
IC50 1.52±n/a nM
Citation Semple, JERowley, DCBrunck, TKHa-Uong, TMinami, NKOwens, TDTamura, SYGoldman, EASiev, DVArdecky, RJCarpenter, SHGe, YRichard, BMNolan, TGHåkanson, KTulinsky, ANutt, RFRipka, WC Design, synthesis, and evolution of a novel, selective, and orally bioavailable class of thrombin inhibitors: P1-argininal derivatives incorporating P3-P4 lactam sulfonamide moieties. J Med Chem39:4531-6 (1996) 
 
Serine protease 1
Name:Serine protease 1
Type:Enzyme
Mol. Mass.:26557.80
Organism:Homo sapiens (Human)
Description:P07477
Residue:247
BDBM50054498
NameBDBM50054498
Synonyms:(R)-1-((R)-2-Methylamino-3-phenyl-propionyl)-pyrrolidine-2-carboxylic acid ((S)-3-carbamimidoyl-2-hydroxy-cyclohexyl)-amide | CHEMBL423543
TypeSmall organic molecule
Emp. Form.C22H33N5O3
Mol. Mass.415.5291
SMILESCN[C@H](Cc1ccccc1)C(=O)N1CCC[C@@H]1C(=O)N[C@H]1CCCC(C1O)C(N)=N