Reaction Details
TargetCoagulation factor X
LigandBDBM50054502
Substrate/Competitorn/a
Meas. Tech.ChEMBL_48647 (CHEMBL656929)
IC50 2500±n/a nM
Citation Semple, JERowley, DCBrunck, TKHa-Uong, TMinami, NKOwens, TDTamura, SYGoldman, EASiev, DVArdecky, RJCarpenter, SHGe, YRichard, BMNolan, TGHåkanson, KTulinsky, ANutt, RFRipka, WC Design, synthesis, and evolution of a novel, selective, and orally bioavailable class of thrombin inhibitors: P1-argininal derivatives incorporating P3-P4 lactam sulfonamide moieties. J Med Chem39:4531-6 (1996) 
 
Coagulation factor X
Name:Coagulation factor X
Type:Enzyme
Mol. Mass.:54726.60
Organism:Homo sapiens (Human)
Description:n/a
Residue:488
BDBM50054502
NameBDBM50054502
Synonyms:CHEMBL140494 | N-((S)-3-Carbamimidoyl-2-hydroxy-cyclohexyl)-2-((S)-2-oxo-3-phenylmethanesulfonylamino-piperidin-1-yl)-acetamide
TypeSmall organic molecule
Emp. Form.C21H31N5O5S
Mol. Mass.465.566
SMILESNC(=N)C1CCC[C@H](NC(=O)CN2CCC[C@H](NS(=O)(=O)Cc3ccccc3)C2=O)C1O