Reaction Details
TargetHistone-lysine N-methyltransferase EHMT2
LigandBDBM50505576
Substrate/Competitorn/a
Meas. Tech.ChEMBL_1823334 (CHEMBL4323098)
IC50 6.0±n/a nM
Citation Fagan, VJohansson, CGileadi, CMonteiro, ODunford, JENibhani, RPhilpott, MMalzahn, JWells, GFaram, RCribbs, APHalidi, NLi, FChau, IGreschik, HVelupillai, SAllali-Hassani, ABennett, JChristott, TGiroud, CLewis, AMHuber, KVMAthanasou, NBountra, CJung, MSchüle, RVedadi, MArrowsmith, CXiong, YJin, JFedorov, OFarnie, GBrennan, PEOppermann, U A Chemical Probe for Tudor Domain Protein Spindlin1 to Investigate Chromatin Function. J Med Chem62:9008-9025 (2019) 
 
Histone-lysine N-methyltransferase EHMT2
Name:Histone-lysine N-methyltransferase EHMT2
Type:Enzyme
Mol. Mass.:132339.87
Organism:Homo sapiens (Human)
Description:Q96KQ7
Residue:1210
BDBM50505576
NameBDBM50505576
Synonyms:CHEMBL4458252
TypeSmall organic molecule
Emp. Form.C20H29N3O2
Mol. Mass.343.4632
SMILESCOc1cc2c(cc1OCCCN1CCCC1)N=C(N)C21CCCC1