Reaction Details
TargetLutropin-choriogonadotropic hormone receptor
LigandBDBM50505784
Substrate/Competitorn/a
Meas. Tech.ChEMBL_1824021 (CHEMBL4323785)
IC50>16500±n/a nM
Citation Wortmann, LLindenthal, BMuhn, PWalter, ANubbemeyer, RHeldmann, DSobek, LMorandi, FSchrey, AKMoosmayer, DGünther, JKuhnke, JKoppitz, MLücking, URöhn, USchäfer, MNowak-Reppel, KKühne, RWeinmann, HLanger, G Discovery of BAY-298 and BAY-899: Tetrahydro-1,6-naphthyridine-Based, Potent, and Selective Antagonists of the Luteinizing Hormone Receptor Which Reduce Sex Hormone Levels in Vivo. J Med Chem62:10321-10341 (2019) 
 
Lutropin-choriogonadotropic hormone receptor
Name:Lutropin-choriogonadotropic hormone receptor
Type:PROTEIN
Mol. Mass.:78662.77
Organism:Homo sapiens (Human)
Description:ChEMBL_562598
Residue:699
BDBM50505784
NameBDBM50505784
Synonyms:CHEMBL4464888
TypeSmall organic molecule
Emp. Form.C25H26FN3O4S2
Mol. Mass.515.62
SMILESCOc1ccc(cc1)C1N(CCc2sccc12)C(=O)Nc1ccc(F)c(c1)N1CCS(=O)(=O)CC1