Reaction Details
TargetLutropin-choriogonadotropic hormone receptor
LigandBDBM50505783
Substrate/Competitorn/a
Meas. Tech.ChEMBL_1824032 (CHEMBL4323796)
IC50 46±n/a nM
Citation Wortmann, LLindenthal, BMuhn, PWalter, ANubbemeyer, RHeldmann, DSobek, LMorandi, FSchrey, AKMoosmayer, DGünther, JKuhnke, JKoppitz, MLücking, URöhn, USchäfer, MNowak-Reppel, KKühne, RWeinmann, HLanger, G Discovery of BAY-298 and BAY-899: Tetrahydro-1,6-naphthyridine-Based, Potent, and Selective Antagonists of the Luteinizing Hormone Receptor Which Reduce Sex Hormone Levels in Vivo. J Med Chem62:10321-10341 (2019) 
 
Lutropin-choriogonadotropic hormone receptor
Name:Lutropin-choriogonadotropic hormone receptor
Type:PROTEIN
Mol. Mass.:78049.26
Organism:Rattus norvegicus
Description:ChEMBL_97289
Residue:700
BDBM50505783
NameBDBM50505783
Synonyms:CHEMBL4458424
TypeSmall organic molecule
Emp. Form.C25H19F2N5O2
Mol. Mass.459.4475
SMILESFc1ccc(Oc2ncc(NC(=O)N3CCc4ncccc4[C@@H]3c3ccc(F)cc3)cn2)cc1