Reaction Details
TargetLutropin-choriogonadotropic hormone receptor
LigandBDBM50505796
Substrate/Competitorn/a
Meas. Tech.ChEMBL_1824021 (CHEMBL4323785)
IC50 127±n/a nM
Citation Wortmann, LLindenthal, BMuhn, PWalter, ANubbemeyer, RHeldmann, DSobek, LMorandi, FSchrey, AKMoosmayer, DGünther, JKuhnke, JKoppitz, MLücking, URöhn, USchäfer, MNowak-Reppel, KKühne, RWeinmann, HLanger, G Discovery of BAY-298 and BAY-899: Tetrahydro-1,6-naphthyridine-Based, Potent, and Selective Antagonists of the Luteinizing Hormone Receptor Which Reduce Sex Hormone Levels in Vivo. J Med Chem62:10321-10341 (2019) 
 
Lutropin-choriogonadotropic hormone receptor
Name:Lutropin-choriogonadotropic hormone receptor
Type:PROTEIN
Mol. Mass.:78662.77
Organism:Homo sapiens (Human)
Description:ChEMBL_562598
Residue:699
BDBM50505796
NameBDBM50505796
Synonyms:CHEMBL4531781
TypeSmall organic molecule
Emp. Form.C26H20ClFN2O2S
Mol. Mass.478.966
SMILESFc1ccc(Oc2ccc(NC(=O)N3CCc4sccc4C3c3ccc(Cl)cc3)cc2)cc1