Reaction Details
TargetLutropin-choriogonadotropic hormone receptor
LigandBDBM50505797
Substrate/Competitorn/a
Meas. Tech.ChEMBL_1824021 (CHEMBL4323785)
IC50 207±n/a nM
Citation Wortmann, LLindenthal, BMuhn, PWalter, ANubbemeyer, RHeldmann, DSobek, LMorandi, FSchrey, AKMoosmayer, DGünther, JKuhnke, JKoppitz, MLücking, URöhn, USchäfer, MNowak-Reppel, KKühne, RWeinmann, HLanger, G Discovery of BAY-298 and BAY-899: Tetrahydro-1,6-naphthyridine-Based, Potent, and Selective Antagonists of the Luteinizing Hormone Receptor Which Reduce Sex Hormone Levels in Vivo. J Med Chem62:10321-10341 (2019) 
 
Lutropin-choriogonadotropic hormone receptor
Name:Lutropin-choriogonadotropic hormone receptor
Type:PROTEIN
Mol. Mass.:78662.77
Organism:Homo sapiens (Human)
Description:ChEMBL_562598
Residue:699
BDBM50505797
NameBDBM50505797
Synonyms:CHEMBL4522381
TypeSmall organic molecule
Emp. Form.C23H24N2O4S
Mol. Mass.424.513
SMILESCOc1ccc(cc1)C1N(CCc2sccc12)C(=O)Nc1cc(OC)cc(OC)c1