Reaction Details
TargetLutropin-choriogonadotropic hormone receptor
LigandBDBM50505801
Substrate/Competitorn/a
Meas. Tech.ChEMBL_1824021 (CHEMBL4323785)
IC50 3240±n/a nM
Citation Wortmann, LLindenthal, BMuhn, PWalter, ANubbemeyer, RHeldmann, DSobek, LMorandi, FSchrey, AKMoosmayer, DGünther, JKuhnke, JKoppitz, MLücking, URöhn, USchäfer, MNowak-Reppel, KKühne, RWeinmann, HLanger, G Discovery of BAY-298 and BAY-899: Tetrahydro-1,6-naphthyridine-Based, Potent, and Selective Antagonists of the Luteinizing Hormone Receptor Which Reduce Sex Hormone Levels in Vivo. J Med Chem62:10321-10341 (2019) 
 
Lutropin-choriogonadotropic hormone receptor
Name:Lutropin-choriogonadotropic hormone receptor
Type:PROTEIN
Mol. Mass.:78662.77
Organism:Homo sapiens (Human)
Description:ChEMBL_562598
Residue:699
BDBM50505801
NameBDBM50505801
Synonyms:CHEMBL4570127
TypeSmall organic molecule
Emp. Form.C20H15Cl2FN2OS
Mol. Mass.421.315
SMILESFc1ccccc1C1N(CCc2sccc12)C(=O)Nc1cc(Cl)cc(Cl)c1