Reaction Details
TargetLutropin-choriogonadotropic hormone receptor
LigandBDBM50505812
Substrate/Competitorn/a
Meas. Tech.ChEMBL_1824021 (CHEMBL4323785)
IC50 312±n/a nM
Citation Wortmann, LLindenthal, BMuhn, PWalter, ANubbemeyer, RHeldmann, DSobek, LMorandi, FSchrey, AKMoosmayer, DGünther, JKuhnke, JKoppitz, MLücking, URöhn, USchäfer, MNowak-Reppel, KKühne, RWeinmann, HLanger, G Discovery of BAY-298 and BAY-899: Tetrahydro-1,6-naphthyridine-Based, Potent, and Selective Antagonists of the Luteinizing Hormone Receptor Which Reduce Sex Hormone Levels in Vivo. J Med Chem62:10321-10341 (2019) 
 
Lutropin-choriogonadotropic hormone receptor
Name:Lutropin-choriogonadotropic hormone receptor
Type:PROTEIN
Mol. Mass.:78662.77
Organism:Homo sapiens (Human)
Description:ChEMBL_562598
Residue:699
BDBM50505812
NameBDBM50505812
Synonyms:CHEMBL4555151
TypeSmall organic molecule
Emp. Form.C26H20F2N4O2
Mol. Mass.458.4594
SMILESFc1ccc(Oc2ccc(NC(=O)N3CCc4ncccc4[C@@H]3c3ccc(F)cc3)cn2)cc1