Reaction Details
TargetLutropin-choriogonadotropic hormone receptor
LigandBDBM50505815
Substrate/Competitorn/a
Meas. Tech.ChEMBL_1824021 (CHEMBL4323785)
IC50 3650±n/a nM
Citation Wortmann, LLindenthal, BMuhn, PWalter, ANubbemeyer, RHeldmann, DSobek, LMorandi, FSchrey, AKMoosmayer, DGünther, JKuhnke, JKoppitz, MLücking, URöhn, USchäfer, MNowak-Reppel, KKühne, RWeinmann, HLanger, G Discovery of BAY-298 and BAY-899: Tetrahydro-1,6-naphthyridine-Based, Potent, and Selective Antagonists of the Luteinizing Hormone Receptor Which Reduce Sex Hormone Levels in Vivo. J Med Chem62:10321-10341 (2019) 
 
Lutropin-choriogonadotropic hormone receptor
Name:Lutropin-choriogonadotropic hormone receptor
Type:PROTEIN
Mol. Mass.:78662.77
Organism:Homo sapiens (Human)
Description:ChEMBL_562598
Residue:699
BDBM50505815
NameBDBM50505815
Synonyms:CHEMBL4468307
TypeSmall organic molecule
Emp. Form.C21H15Cl2F3N2OS
Mol. Mass.471.323
SMILESFC(F)(F)c1ccc(cc1)C1N(CCc2sccc12)C(=O)Nc1cc(Cl)cc(Cl)c1