Reaction Details
TargetLutropin-choriogonadotropic hormone receptor
LigandBDBM50505787
Substrate/Competitorn/a
Meas. Tech.ChEMBL_1824119 (CHEMBL4323883)
IC50 97.0±n/a nM
Citation Wortmann, LLindenthal, BMuhn, PWalter, ANubbemeyer, RHeldmann, DSobek, LMorandi, FSchrey, AKMoosmayer, DGünther, JKuhnke, JKoppitz, MLücking, URöhn, USchäfer, MNowak-Reppel, KKühne, RWeinmann, HLanger, G Discovery of BAY-298 and BAY-899: Tetrahydro-1,6-naphthyridine-Based, Potent, and Selective Antagonists of the Luteinizing Hormone Receptor Which Reduce Sex Hormone Levels in Vivo. J Med Chem62:10321-10341 (2019) 
 
Lutropin-choriogonadotropic hormone receptor
Name:Lutropin-choriogonadotropic hormone receptor
Type:PROTEIN
Mol. Mass.:78662.77
Organism:Homo sapiens (Human)
Description:ChEMBL_562598
Residue:699
BDBM50505787
NameBDBM50505787
Synonyms:CHEMBL4537998
TypeSmall organic molecule
Emp. Form.C27H21ClFN3O2
Mol. Mass.473.926
SMILESFc1ccc(Oc2ccc(NC(=O)N3CCc4ncccc4[C@@H]3c3ccc(Cl)cc3)cc2)cc1