Reaction Details
TargetSigma non-opioid intracellular receptor 1
LigandBDBM50507211
Substrate/Competitorn/a
Meas. Tech.ChEMBL_1829443 (CHEMBL4329317)
Ki 5.1±n/a nM
Citation Lalut, JSantoni, GKarila, DLecoutey, CDavis, ANachon, FSilman, ISussman, JWeik, MMaurice, TDallemagne, PRochais, C Novel multitarget-directed ligands targeting acetylcholinesterase and ? Eur J Med Chem162:234-248 (2019) 
 
Sigma non-opioid intracellular receptor 1
Name:Sigma non-opioid intracellular receptor 1
Type:Enzyme Catalytic Domain
Mol. Mass.:25124.85
Organism:Homo sapiens (Human)
Description:Q99720
Residue:223
BDBM50507211
NameBDBM50507211
Synonyms:CHEMBL4444843
TypeSmall organic molecule
Emp. Form.C23H31ClN2O
Mol. Mass.386.958
SMILESClc1cc(cc2cc[nH]c12)C(=O)CCC1CCN(CC2CCCCC2)CC1